BDBM50006845 CHEMBL316208::N-[2-(2-Amino-thiazol-4-yl)-1-(1-cyclohexylmethyl-2,3-dihydroxy-5-methyl-hexylcarbamoyl)-ethyl]-3-(4-methoxy-phenyl)-2-(morpholine-4-sulfonylamino)-propionamide
SMILES COc1ccc(C[C@H](NS(=O)(=O)N2CCOCC2)C(=O)N[C@@H](Cc2csc(N)n2)C(=O)N[C@@H](CC2CCCCC2)[C@@H](O)[C@@H](O)CC(C)C)cc1
InChI Key InChIKey=QLXHRYKGTCSNKH-STVCLKQXSA-N
Data  2 IC50
  Tab Delimited (TSV)   2D SDfile   Computed 3D by Vconf -m prep SDfile
Find this compound or compounds like it in BindingDB:
Activity Spreadsheet -- Enzyme Inhibition Constant Data from BindingDB
Found 2 hits for monomerid = 50006845
TargetCathepsin D(Bos taurus)
Parke-Davis Pharmaceutical Research Division Of Warner-Lambert
Curated by ChEMBL
LigandPNGBDBM50006845(CHEMBL316208 | N-[2-(2-Amino-thiazol-4-yl)-1-(1-cy...)
Affinity DataIC50:  2.17E+3nM. Assay description: Inhibition of Bovine Cathepsin D
In DepthDetails ArticlePubMed
TargetRenin(Homo sapiens (Human))
Parke-Davis Pharmaceutical Research Division Of Warner-Lambert
Curated by ChEMBL
LigandPNGBDBM50006845(CHEMBL316208 | N-[2-(2-Amino-thiazol-4-yl)-1-(1-cy...)
Affinity DataIC50:  0.350nM. Assay description: In vitro inhibition of monkey renin.
In DepthDetails ArticlePubMed