BDBM50006858 CHEMBL315380::N-[1-(1-Cyclohexylmethyl-2,3-dihydroxy-5-methyl-hexylcarbamoyl)-2-(1H-imidazol-4-yl)-ethyl]-2-(morpholine-4-sulfonylamino)-3-phenyl-propionamide
SMILES CC(C)C[C@H](O)[C@H](O)[C@H](CC1CCCCC1)NC(=O)[C@H](Cc1cnc[nH]1)NC(=O)[C@H](Cc1ccccc1)NS(=O)(=O)N1CCOCC1
InChI Key InChIKey=ZJDRDAKKIABCDV-STVCLKQXSA-N
Data  2 IC50
  Tab Delimited (TSV)   2D SDfile   Computed 3D by Vconf -m prep SDfile
Find this compound or compounds like it in BindingDB:
Activity Spreadsheet -- Enzyme Inhibition Constant Data from BindingDB
Found 2 hits for monomerid = 50006858
TargetRenin(Homo sapiens (Human))
Parke-Davis Pharmaceutical Research Division Of Warner-Lambert
Curated by ChEMBL
LigandPNGBDBM50006858(CHEMBL315380 | N-[1-(1-Cyclohexylmethyl-2,3-dihydr...)
Affinity DataIC50:  0.230nM. Assay description: In vitro inhibition of monkey renin.
In DepthDetails ArticlePubMed
TargetCathepsin D(Bos taurus)
Parke-Davis Pharmaceutical Research Division Of Warner-Lambert
Curated by ChEMBL
LigandPNGBDBM50006858(CHEMBL315380 | N-[1-(1-Cyclohexylmethyl-2,3-dihydr...)
Affinity DataIC50:  5.18E+4nM. Assay description: Inhibition of Bovine Cathepsin D
In DepthDetails ArticlePubMed