BDBM50006961 2-(2-Dimethylamino-ethyl)-4,9-dihydro-2,4,9-triaza-fluorene-1,3-dione::CHEMBL52878
SMILES CN(C)CCn1c(=O)[nH]c2c3ccccc3[nH]c2c1=O
InChI Key InChIKey=LZNMTCLKEBAHST-UHFFFAOYSA-N
Data  1 KI
  Tab Delimited (TSV)   2D SDfile   Computed 3D by Vconf -m prep SDfile
Find this compound or compounds like it in BindingDB:
Activity Spreadsheet -- Enzyme Inhibition Constant Data from BindingDB
Found 1 hit for monomerid = 50006961
TargetAlpha-1A adrenergic receptor(Rattus norvegicus (Rat))
Universitá
Curated by ChEMBL
LigandPNGBDBM50006961(2-(2-Dimethylamino-ethyl)-4,9-dihydro-2,4,9-triaza...)
Affinity DataKi: >1.00E+5nM. Assay description: Binding affinity measured for alpha-1 adrenergic receptor by displacement of [3H]-prazosin from rat cortical membranes
In DepthDetails ArticlePubMed