BDBM50007183 4-Hydroxy-N-{4-[4-(2-methoxy-phenyl)-piperazin-1-yl]-butyl}-benzamide::CHEMBL27377
SMILES COc1ccccc1N1CCN(CCCCNC(=O)c2ccc(O)cc2)CC1
InChI Key InChIKey=YSJVPVOMUFQUSU-UHFFFAOYSA-N
Data  3 KI
  Tab Delimited (TSV)   2D SDfile   Computed 3D by Vconf -m prep SDfile
Find this compound or compounds like it in BindingDB:
Activity Spreadsheet -- Enzyme Inhibition Constant Data from BindingDB
Found 3 hits for monomerid = 50007183
Target5-hydroxytryptamine receptor 1A(Rattus norvegicus (rat))
Virginia Commonwealth University
Curated by ChEMBL
LigandPNGBDBM50007183(4-Hydroxy-N-{4-[4-(2-methoxy-phenyl)-piperazin-1-y...)
Affinity DataKi:  5.40nM. Assay description: Binding affinity towards 5-hydroxytryptamine 1A receptor of rat hippocampus using [3H]-8-hydroxy-2-(di-n-propylamine) tetralin (8-OH-DPAT) as a radio...
In DepthDetails ArticlePubMed
Target5-hydroxytryptamine receptor 1A(Rattus norvegicus (rat))
Virginia Commonwealth University
Curated by ChEMBL
LigandPNGBDBM50007183(4-Hydroxy-N-{4-[4-(2-methoxy-phenyl)-piperazin-1-y...)
Affinity DataKi:  5.40nM. Assay description: Binding affinity of a compound to rat brain 5-hydroxytryptamine 1A (serotonin) receptor assayed by radiolabeled [3H]-8-OH-DPAT ligand displacement
In DepthDetails ArticlePubMed
TargetAlpha-1A/Alpha-1B/Alpha-1D adrenergic receptor(Rattus norvegicus (rat))
Virginia Commonwealth University
Curated by ChEMBL
LigandPNGBDBM50007183(4-Hydroxy-N-{4-[4-(2-methoxy-phenyl)-piperazin-1-y...)
Affinity DataKi:  17nM. Assay description: Binding affinity towards alpha-1 adrenergic receptor of rat frontal cortex using [3H]- WB- 4101 as a radioligand
In DepthDetails ArticlePubMed