BDBM50007257 CHEMBL323344::Sodium; 6-{2-[cyclohexyl-(1,1-dimethyl-propoxycarbonyl)-methyl]-4,6-dimethyl-phenoxy}-3,5-dihydroxy-hexanoate
SMILES CCC(C)(C)OC(=O)C(C1CCCCC1)c1cc(C)cc(C)c1OCC(O)C[C@@H](O)CC([O-])=O
InChI Key InChIKey=RMQCSWXMHKVTBQ-UZGSZPBKSA-M
Data  4 IC50
  Tab Delimited (TSV)   2D SDfile   Computed 3D by Vconf -m prep SDfile
Find this compound or compounds like it in BindingDB:
Activity Spreadsheet -- Enzyme Inhibition Constant Data from BindingDB
Found 4 hits for monomerid = 50007257
Target3-hydroxy-3-methylglutaryl-coenzyme A reductase(Homo sapiens (Human))
Hoechst
Curated by ChEMBL
LigandPNGBDBM50007257(CHEMBL323344 | Sodium; 6-{2-[cyclohexyl-(1,1-dimet...)
Affinity DataIC50:  1.70E+3nM. Assay description: Inhibition of the incorporation of sodium [14C]acetate into cholesterol in HEP G2 cells.
In DepthDetails ArticlePubMed
Target3-hydroxy-3-methylglutaryl-coenzyme A reductase(Homo sapiens (Human))
Hoechst
Curated by ChEMBL
LigandPNGBDBM50007257(CHEMBL323344 | Sodium; 6-{2-[cyclohexyl-(1,1-dimet...)
Affinity DataIC50:  1.70E+3nM. Assay description: In vitro inhibition of HMG-CoA reductase in solubilized rat liver.
In DepthDetails ArticlePubMed
Target3-hydroxy-3-methylglutaryl-coenzyme A reductase(Rattus norvegicus (rat))
Hoechst
Curated by ChEMBL
LigandPNGBDBM50007257(CHEMBL323344 | Sodium; 6-{2-[cyclohexyl-(1,1-dimet...)
Affinity DataIC50:  500nM. Assay description: Inhibition of the incorporation of sodium [14C]acetate into cholesterol in HEP G2 cells.
In DepthDetails ArticlePubMed
Target3-hydroxy-3-methylglutaryl-coenzyme A reductase(Rattus norvegicus (rat))
Hoechst
Curated by ChEMBL
LigandPNGBDBM50007257(CHEMBL323344 | Sodium; 6-{2-[cyclohexyl-(1,1-dimet...)
Affinity DataIC50:  500nM. Assay description: In vitro inhibition of HMG-CoA reductase in solubilized rat liver.
In DepthDetails ArticlePubMed