BDBM50007323 13-[2-Amino-3-(4-hydroxy-phenyl)-propionylamino]-2-benzyl-3,8,14-trioxo-1,4,9triaza-cyclotetradecane-5-carboxylic acid amide::CHEMBL105568
SMILES N[C@@H](Cc1ccc(O)cc1)C(=O)N[C@@H]1CCCNC(=O)CC[C@H](NC(=O)[C@@H](Cc2ccccc2)NC1=O)C(N)=O
InChI Key InChIKey=YAHJIURYXALSGX-MYDTUXCISA-N
Data  2 KI
  Tab Delimited (TSV)   2D SDfile   Computed 3D by Vconf -m prep SDfile
Find this compound or compounds like it in BindingDB:
Activity Spreadsheet -- Enzyme Inhibition Constant Data from BindingDB
Found 2 hits for monomerid = 50007323
TargetMu-type opioid receptor(Rattus norvegicus (rat))
Clinical Research Institute Of Montreal
Curated by ChEMBL
LigandPNGBDBM50007323(13-[2-Amino-3-(4-hydroxy-phenyl)-propionylamino]-2...)
Affinity DataKi:  1.66E+3nM. Assay description: Displacement of [3H]-DAGO from rat brain membrane opioid receptor mu
In DepthDetails ArticlePubMed
TargetDelta-type opioid receptor(Rattus norvegicus (rat))
Clinical Research Institute Of Montreal
Curated by ChEMBL
LigandPNGBDBM50007323(13-[2-Amino-3-(4-hydroxy-phenyl)-propionylamino]-2...)
Affinity DataKi:  1.40E+4nM. Assay description: Displacement of [3H]-DSLET from rat brain membrane opioid receptor delta
In DepthDetails ArticlePubMed