BDBM50007340 2-(3,4-Dichloro-phenyl)-N-[2-(2,5-dihydro-pyrrol-1-yl)-1-phenyl-ethyl]-N-methyl-acetamide::CHEMBL108344
SMILES CN([C@H](CN1CC=CC1)c1ccccc1)C(=O)Cc1ccc(Cl)c(Cl)c1
InChI Key InChIKey=AHJJCDWRBWUNDK-HXUWFJFHSA-N
Data  1 IC50
  Tab Delimited (TSV)   2D SDfile   Computed 3D by Vconf -m prep SDfile
Find this compound or compounds like it in BindingDB:
Activity Spreadsheet -- Enzyme Inhibition Constant Data from BindingDB
Found 1 hit for monomerid = 50007340
TargetKappa-type opioid receptor(Cavia porcellus (domestic guinea pig))
Ici Pharmaceuticals Group
Curated by ChEMBL
LigandPNGBDBM50007340(2-(3,4-Dichloro-phenyl)-N-[2-(2,5-dihydro-pyrrol-1...)
Affinity DataIC50:  11nM. Assay description: Binding affinity against opioid receptor kappa in guinea pig brain membrane using [3H]bremazocine as the radioligand
In DepthDetails ArticlePubMed