BDBM50007367 2-(3,4-Dichloro-phenyl)-N-methyl-N-(2-methyl-1-piperidin-1-ylmethyl-propyl)-acetamide::CHEMBL109205
SMILES CC(C)[C@@H](CN1CCCCC1)N(C)C(=O)Cc1ccc(Cl)c(Cl)c1
InChI Key InChIKey=BMSLJPQGUMZLNE-GOSISDBHSA-N
Data  1 IC50
  Tab Delimited (TSV)   2D SDfile   Computed 3D by Vconf -m prep SDfile
Find this compound or compounds like it in BindingDB:
Activity Spreadsheet -- Enzyme Inhibition Constant Data from BindingDB
Found 1 hit for monomerid = 50007367
TargetKappa-type opioid receptor(Cavia porcellus (domestic guinea pig))
Ici Pharmaceuticals Group
Curated by ChEMBL
LigandPNGBDBM50007367(2-(3,4-Dichloro-phenyl)-N-methyl-N-(2-methyl-1-pip...)
Affinity DataIC50:  11nM. Assay description: Binding affinity against opioid receptor kappa, in guinea pig brain membrane, using [3H]bremazocine as the radioligand.
In DepthDetails ArticlePubMed