BDBM50007403 1-(2-pyrimidyl)piperazine::1-PP::2-Piperazin-1-Yl-Pyrimidine::CHEMBL724::EN300-33983
SMILES C1CN(CCN1)c1ncccn1
InChI Key InChIKey=MRBFGEHILMYPTF-UHFFFAOYSA-N
Data  4 KI  1 IC50
  Tab Delimited (TSV)   2D SDfile   Computed 3D by Vconf -m prep SDfile
Find this compound or compounds like it in BindingDB:
Activity Spreadsheet -- Enzyme Inhibition Constant Data from BindingDB
Found 5 hits for monomerid = 50007403
Target5-hydroxytryptamine receptor 1A(Rattus norvegicus (rat))
Virginia Commonwealth University
Curated by ChEMBL
LigandPNGBDBM50007403(1-(2-pyrimidyl)piperazine | 1-PP | 2-Piperazin-1-Y...)
Affinity DataKi:  1.41E+3nM. Assay description: Evaluated for binding affinity towards 5-hydroxytryptamine 1A receptor in rat brain
In DepthDetails ArticlePubMed
Target5-hydroxytryptamine receptor 1A(Rattus norvegicus (rat))
Virginia Commonwealth University
Curated by ChEMBL
LigandPNGBDBM50007403(1-(2-pyrimidyl)piperazine | 1-PP | 2-Piperazin-1-Y...)
Affinity DataKi:  1.41E+3nM. Assay description: Binding affinity of a compound to rat brain 5-hydroxytryptamine 1A (serotonin) receptor assayed by radiolabeled [3H]-8-OH-DPAT ligand displacement
In DepthDetails ArticlePubMed
Target5-hydroxytryptamine receptor 3A(RAT)
Virginia Commonwealth University
Curated by PDSP Ki Database
LigandPNGBDBM50007403(1-(2-pyrimidyl)piperazine | 1-PP | 2-Piperazin-1-Y...)
Affinity DataKi:  4.00E+3nM
In DepthDetails ArticlePubMed
TargetSigma non-opioid intracellular receptor 1(Homo sapiens (Human))
Virginia Commonwealth University
Curated by ChEMBL
LigandPNGBDBM50007403(1-(2-pyrimidyl)piperazine | 1-PP | 2-Piperazin-1-Y...)
Affinity DataKi: >1.00E+4nM. Assay description: Binding affinity of the compound towards sigma receptor in guinea pig brain membranes using [3H]-DTG as radioligand
In DepthDetails ArticlePubMed
TargetReplicase polyprotein 1ab(2019-nCoV)
Cornell University
LigandPNGBDBM50007403(1-(2-pyrimidyl)piperazine | 1-PP | 2-Piperazin-1-Y...)
Affinity DataIC50:  2.52E+3nM. Assay description: IC50 values were determined for the whole plate in case of Chan-Lam coupling, using 5 point 3-fold dilutions (starting from 10 μM).
In DepthDetails PubMed