BDBM50007467 1-[4-(5,6-Dihydro-benzo[5,6]cyclohepta[1,2-b]pyridin-11-ylidene)-piperidin-1-yl]-ethanone::CHEMBL140483
SMILES [#6]-[#6](=O)-[#7]-1-[#6]-[#6]\[#6](-[#6]-[#6]-1)=[#6]-1/c2ccccc2-[#6]-[#6]-c2cccnc-12
InChI Key InChIKey=DUBAGCAHNNYUJQ-UHFFFAOYSA-N
Data  1 KI  1 IC50
  Tab Delimited (TSV)   2D SDfile   Computed 3D by Vconf -m prep SDfile
Find this compound or compounds like it in BindingDB:
Activity Spreadsheet -- Enzyme Inhibition Constant Data from BindingDB
Found 2 hits for monomerid = 50007467
TargetHistamine H1 receptor(RAT)
Schering-Plough
Curated by ChEMBL
LigandPNGBDBM50007467(1-[4-(5,6-Dihydro-benzo[5,6]cyclohepta[1,2-b]pyrid...)
Affinity DataKi:  2.00E+3nM. Assay description: Binding affinity to histamine H1 receptor in rat brain membranes was evaluated using [3H]-pyrilamine as radioligand
In DepthDetails ArticlePubMed
TargetPlatelet-activating factor receptor(Homo sapiens (Human))
Schering-Plough
Curated by ChEMBL
LigandPNGBDBM50007467(1-[4-(5,6-Dihydro-benzo[5,6]cyclohepta[1,2-b]pyrid...)
Affinity DataIC50:  1.40E+3nM. Assay description: Concentration required to cause 50% inhibition of platelet activating factor (PAF)-induced platelet aggregation of human platelet rich plasma when ch...
In DepthDetails ArticlePubMed