BDBM50007556 6-[2-(4-Naphthalen-1-yl-piperazin-1-yl)-ethyl]-3H-benzooxazol-2-one::CHEMBL55362
SMILES O=c1[nH]c2ccc(CCN3CCN(CC3)c3cccc4ccccc34)cc2o1
InChI Key InChIKey=DPNXNSJFFDGJRR-UHFFFAOYSA-N
Data  2 IC50
  Tab Delimited (TSV)   2D SDfile   Computed 3D by Vconf -m prep SDfile
Find this compound or compounds like it in BindingDB:
Activity Spreadsheet -- Enzyme Inhibition Constant Data from BindingDB
Found 2 hits for monomerid = 50007556
Target5-hydroxytryptamine receptor 1A(Rattus norvegicus (rat))
Pfizer
Curated by ChEMBL
LigandPNGBDBM50007556(6-[2-(4-Naphthalen-1-yl-piperazin-1-yl)-ethyl]-3H-...)
Affinity DataIC50:  6.20nM. Assay description: Binding affinity to 5-hydroxytryptamine 1A receptor in the rat brain using [3H]-8-hydroxy-2-(di-n-propylamine)tetralin as radioligand.
In DepthDetails ArticlePubMed
TargetD(2) dopamine receptor(Rattus norvegicus (rat))
Pfizer
Curated by ChEMBL
LigandPNGBDBM50007556(6-[2-(4-Naphthalen-1-yl-piperazin-1-yl)-ethyl]-3H-...)
Affinity DataIC50:  44nM. Assay description: Binding affinity to dopamine receptor D2 in the rat brain using [3H]-NPA as radioligand
In DepthDetails ArticlePubMed