BDBM50007603 CHEMBL3238277
SMILES C[C@](O)(COc1ccc(Cl)cc1)C(=O)N1CCc2c1cccc2C#N
InChI Key InChIKey=GJHJRGLJWHMEEG-IBGZPJMESA-N
Data  1 IC50  2 EC50
  Tab Delimited (TSV)   2D SDfile   Computed 3D by Vconf -m prep SDfile
Find this compound or compounds like it in BindingDB:
Activity Spreadsheet -- Enzyme Inhibition Constant Data from BindingDB
Found 3 hits for monomerid = 50007603
TargetAndrogen receptor(Homo sapiens (Human))
Pfizer
Curated by ChEMBL
LigandPNGBDBM50007603(CHEMBL3238277)
Affinity DataEC50:  172nM. Assay description: Binding affinity to human AR NTD (1 to 561 aa) expressed in CV1 cells coexpressing human AR-LBD (644-919 aa) assessed as N/C-termini interaction by a...
In DepthDetails ArticlePubMed
TargetAndrogen receptor(Homo sapiens (Human))
Pfizer
Curated by ChEMBL
LigandPNGBDBM50007603(CHEMBL3238277)
Affinity DataIC50:  37nM. Assay description: Displacement of [3H]mibolerone from full length human AR expressed in COS cells after 3.5 hrs by liquid scintillation counting
In DepthDetails ArticlePubMed
TargetAndrogen receptor(Homo sapiens (Human))
Pfizer
Curated by ChEMBL
LigandPNGBDBM50007603(CHEMBL3238277)
Affinity DataEC50:  3.40nM. Assay description: Agonist activity at human AR expressed in CV1 cells after 17 hrs by luciferase reporter gene assay
In DepthDetails ArticlePubMed