BDBM50007711 CHEMBL3233420
SMILES [H][C@]12CCN(CCCC(=O)c3ccc(F)cc3)C[C@]1([H])c1cccc3N(C)CCN2c13
InChI Key InChIKey=HOIIHACBCFLJET-RTWAWAEBSA-N
Data  4 KI
  Tab Delimited (TSV)   2D SDfile   Computed 3D by Vconf -m prep SDfile
Find this compound or compounds like it in BindingDB:
Activity Spreadsheet -- Enzyme Inhibition Constant Data from BindingDB
Found 4 hits for monomerid = 50007711
TargetD(2) dopamine receptor(Rattus norvegicus (rat))
Intra-Cellular Therapies
Curated by ChEMBL
LigandPNGBDBM50007711(CHEMBL3233420)
Affinity DataKi:  97nM. Assay description: Displacement of [3H]-N-methylspiperone from rat recombinant dopamine D2 short receptor expressed in CHO cells
In DepthDetails ArticlePubMed
TargetSodium-dependent serotonin transporter(Homo sapiens (Human))
Intra-Cellular Therapies
Curated by ChEMBL
LigandPNGBDBM50007711(CHEMBL3233420)
Affinity DataKi: >1.00E+3nM. Assay description: Displacement of [3H]-N-methyl-citalopram from SERT in human platelets after 60 mins by liquid scintillation counting analysis
In DepthDetails ArticlePubMed
Target5-hydroxytryptamine receptor 2A(Homo sapiens (Human))
Intra-Cellular Therapies
Curated by ChEMBL
LigandPNGBDBM50007711(CHEMBL3233420)
Affinity DataKi: >1.00E+3nM. Assay description: Displacement of [125]DOI from human recombinant full length 5HT2A receptor expressed in HEK293E cells
In DepthDetails ArticlePubMed
Target5-hydroxytryptamine receptor 2C(Homo sapiens (Human))
Intra-Cellular Therapies
Curated by ChEMBL
LigandPNGBDBM50007711(CHEMBL3233420)
Affinity DataKi: >1.00E+3nM. Assay description: Displacement of [125]DOI from human recombinant full length 5HT2C receptor expressed in HEK293E cells
In DepthDetails ArticlePubMed