BDBM50007834 1,3-Dipropyl-8-pyrrolidin-1-yl-3,7-dihydro-purine-2,6-dione::CHEMBL417770
SMILES CCCn1c2nc([nH]c2c(=O)n(CCC)c1=O)N1CCCC1
InChI Key InChIKey=GNPJLZZDCJQSCM-UHFFFAOYSA-N
Data  2 KI
  Tab Delimited (TSV)   2D SDfile   Computed 3D by Vconf -m prep SDfile
Find this compound or compounds like it in BindingDB:
Activity Spreadsheet -- Enzyme Inhibition Constant Data from BindingDB
Found 2 hits for monomerid = 50007834
TargetAdenosine receptor A1(Homo sapiens (Human))
Vanderbilt University
Curated by ChEMBL
LigandPNGBDBM50007834(1,3-Dipropyl-8-pyrrolidin-1-yl-3,7-dihydro-purine-...)
Affinity DataKi:  76nM. Assay description: Antagonist activity against adenosine A1 receptor in human platelets
In DepthDetails ArticlePubMed
TargetAdenosine receptor A2a/A2b(Rattus norvegicus)
Vanderbilt University
Curated by ChEMBL
LigandPNGBDBM50007834(1,3-Dipropyl-8-pyrrolidin-1-yl-3,7-dihydro-purine-...)
Affinity DataKi: >3.00E+3nM. Assay description: Antagonistic activity against adenosine A2 receptor in rat adipocytes
In DepthDetails ArticlePubMed