BDBM50007862 2-Oxo-2,3-dihydro-benzoimidazole-1-carboxylic acid methyl-(9-methyl-9-aza-bicyclo[3.3.1]non-3-yl)-amide::CHEMBL63621
SMILES CN(C1CC2CCCC(C1)N2C)C(=O)n1c2ccccc2[nH]c1=O
InChI Key InChIKey=IQARRFVNDVOHGQ-UHFFFAOYSA-N
Data  1 KI
  Tab Delimited (TSV)   2D SDfile   Computed 3D by Vconf -m prep SDfile
Find this compound or compounds like it in BindingDB:
Activity Spreadsheet -- Enzyme Inhibition Constant Data from BindingDB
Found 1 hit for monomerid = 50007862
Target5-hydroxytryptamine receptor 3A/3B(Rattus norvegicus)
Istituto De Angeli
Curated by ChEMBL
LigandPNGBDBM50007862(2-Oxo-2,3-dihydro-benzoimidazole-1-carboxylic acid...)
Affinity DataKi: >1.00E+3nM. Assay description: Concentration that inhibits the binding of radioligand, [3H]-ICS 205930, to 5-hydroxytryptamine 3 receptor from rat cortex
In DepthDetails ArticlePubMed