BDBM50008040 3-Benzoyloxy-8-methyl-8-aza-bicyclo[3.2.1]octane-2-carboxylic acid 3-phenyl-propyl ester; compound with but-2-enedioic acid::CHEMBL31837
SMILES CN1[C@@H]2CCC1C([C@H](C2)OC(=O)c1ccccc1)C(=O)OCCCc1ccccc1
InChI Key InChIKey=LLAHJYBITWOMNU-NHIVGREZSA-N
Data  1 IC50
  Tab Delimited (TSV)   2D SDfile   Computed 3D by Vconf -m prep SDfile
Find this compound or compounds like it in BindingDB:
Activity Spreadsheet -- Enzyme Inhibition Constant Data from BindingDB
Found 1 hit for monomerid = 50008040
TargetSodium-dependent dopamine transporter(Rattus norvegicus (rat))
Research Triangle Institute
Curated by ChEMBL
LigandPNGBDBM50008040(3-Benzoyloxy-8-methyl-8-aza-bicyclo[3.2.1]octane-2...)
Affinity DataIC50:  139nM. Assay description: Inhibition of [3H]3-beta-(p-fluorophenyl)tropane-2beta-carboxylic acid methyl ester binding to Dopamine transporter in rat striatal membranes.
In DepthDetails ArticlePubMed