BDBM50008061 3,5-Difluoro-benzoic acid 6-methyl-6-aza-bicyclo[3.2.1]oct-3-yl ester::CHEMBL32987
SMILES CN1CC2CC1CC(C2)OC(=O)c1cc(F)cc(F)c1
InChI Key InChIKey=KNPHZKMIPVOZPG-UHFFFAOYSA-N
Data  1 IC50
  Tab Delimited (TSV)   2D SDfile   Computed 3D by Vconf -m prep SDfile
Find this compound or compounds like it in BindingDB:
Activity Spreadsheet -- Enzyme Inhibition Constant Data from BindingDB
Found 1 hit for monomerid = 50008061
TargetSodium-dependent dopamine transporter(Rattus norvegicus (rat))
Research Triangle Institute
Curated by ChEMBL
LigandPNGBDBM50008061(3,5-Difluoro-benzoic acid 6-methyl-6-aza-bicyclo[3...)
Affinity DataIC50:  9.03E+3nM. Assay description: Inhibition of [3H]3-beta-(p-fluorophenyl)tropane-2beta-carboxylic acid methyl ester [3H]7a binding to Dopamine transporter of rat striatal membranes
In DepthDetails ArticlePubMed