BDBM50008080 5-(4-Ethyl-tetrahydro-furan-3-ylmethyl)-1-methyl-1H-imidazole::CHEMBL92429
SMILES CC[C@@H]1COC[C@@H]1Cc1cncn1C
InChI Key InChIKey=GWYMEWXHNCZXOM-ZJUUUORDSA-N
Data  2 IC50
  Tab Delimited (TSV)   2D SDfile   Computed 3D by Vconf -m prep SDfile
Find this compound or compounds like it in BindingDB:
Activity Spreadsheet -- Enzyme Inhibition Constant Data from BindingDB
Found 2 hits for monomerid = 50008080
LigandPNGBDBM50008080(5-(4-Ethyl-tetrahydro-furan-3-ylmethyl)-1-methyl-1...)
Affinity DataIC50:  445nM. Assay description: Central presynaptic activity as effect on electrically evoked acetylcholine release from rat hippocampal slices (M2 model)
In DepthDetails ArticlePubMed
TargetMuscarinic acetylcholine receptor M1(RAT)
Sandoz Pharma
Curated by ChEMBL
LigandPNGBDBM50008080(5-(4-Ethyl-tetrahydro-furan-3-ylmethyl)-1-methyl-1...)
Affinity DataIC50:  1.80E+3nM. Assay description: Ability to displace [3H]-pirenzepine (pir) from muscarinic acetylcholine receptor M1 in rat cortical tissue.
In DepthDetails ArticlePubMed