BDBM50008212 4-(3-Chloro-benzoylamino)-4-(3-ethyl-3-methyl-pentylcarbamoyl)-butyric acid::CHEMBL338929
SMILES CCC(C)(CC)CCNC(=O)C(CCC(O)=O)NC(=O)c1cccc(Cl)c1
InChI Key InChIKey=NSRJJORETYUONF-UHFFFAOYSA-N
Data  2 IC50
  Tab Delimited (TSV)   2D SDfile   Computed 3D by Vconf -m prep SDfile
Find this compound or compounds like it in BindingDB:
Activity Spreadsheet -- Enzyme Inhibition Constant Data from BindingDB
Found 2 hits for monomerid = 50008212
TargetCholecystokinin receptor type A(RAT)
Rotta Research Laboratorium
Curated by ChEMBL
LigandPNGBDBM50008212(4-(3-Chloro-benzoylamino)-4-(3-ethyl-3-methyl-pent...)
Affinity DataIC50:  1.11E+4nM. Assay description: Concentration required to inhibit by 50% specific binding of [125I](BH)-CCK-8 to cholecystokinin type A receptor in rat pancreatic acini
In DepthDetails ArticlePubMed
TargetGastrin/cholecystokinin type B receptor(RAT)
Rotta Research Laboratorium
Curated by ChEMBL
LigandPNGBDBM50008212(4-(3-Chloro-benzoylamino)-4-(3-ethyl-3-methyl-pent...)
Affinity DataIC50:  1.90E+3nM. Assay description: Inhibition of the specific binding of [125I](BH)-CCK-8 to Cholecystokinin type B receptor in rat brain cortex
In DepthDetails ArticlePubMed