BDBM50008226 2-[2-(2-{2-[2-(2-{2-[2-Acetylamino-3-(3H-imidazol-4-yl)-propionylamino]-6-amino-hexanoylamino}-3-carboxy-propionylamino)-3-cyclohexyl-propionylamino]-3-cyclohexyl-propionylamino}-4-methyl-pentanoylamino)-propionylamino]-5-guanidino-pentanoic acid::CHEMBL2369494
SMILES CCCC[C@H](NC(=O)[C@H](CCCC)NC(=O)[C@H](CCCC)NC(=O)[C@H](CC(O)=O)NC(=O)[C@H](CCCCN)NC(=O)[C@H](Cc1c[nH]cn1)NC(C)=O)C(=O)NCC(=O)N[C@@H](CCCN=C(N)N)C(O)=O
InChI Key InChIKey=HKSHQDYZLSMHHD-NXBWRCJVSA-N
Data  1 KI
  Tab Delimited (TSV)   2D SDfile   Computed 3D by Vconf -m prep SDfile
Find this compound or compounds like it in BindingDB:
Activity Spreadsheet -- Enzyme Inhibition Constant Data from BindingDB
Found 1 hit for monomerid = 50008226
TargetC5a anaphylatoxin chemotactic receptor 1(Homo sapiens (Human))
Abbott Laboratories
Curated by ChEMBL
LigandPNGBDBM50008226(2-[2-(2-{2-[2-(2-{2-[2-Acetylamino-3-(3H-imidazol-...)
Affinity DataKi:  2.10E+5nM. Assay description: Ability to inhibit the binding of [125I]-C5a anaphylatoxin chemotactic receptor to polymorphonuclear leukocyte (PMNL) membrane receptor
In DepthDetails ArticlePubMed