BDBM50008287 2-{4-[2-(2,4-Diamino-pyrido[2,3-d]pyrimidin-6-yl)-1-methyl-ethyl]-benzoylamino}-pentanedioic acid::CHEMBL110251
SMILES CC(Cc1cnc2nc(N)nc(N)c2c1)c1ccc(cc1)C(=O)NC(CCC(O)=O)C(O)=O
InChI Key InChIKey=IBBJCSZQBBGNDY-UHFFFAOYSA-N
Data  2 KI
  Tab Delimited (TSV)   2D SDfile   Computed 3D by Vconf -m prep SDfile
Find this compound or compounds like it in BindingDB:
Activity Spreadsheet -- Enzyme Inhibition Constant Data from BindingDB
Found 2 hits for monomerid = 50008287
TargetDihydrofolate reductase(Mus musculus (Mouse))
Sri International
Curated by ChEMBL
LigandPNGBDBM50008287(2-{4-[2-(2,4-Diamino-pyrido[2,3-d]pyrimidin-6-yl)-...)
Affinity DataKi:  0.00700nM. Assay description: Inhibitory activity of Dihydrofolate reductase derived from L1210 cell line.
In DepthDetails ArticlePubMed
TargetDihydrofolate reductase(Mus musculus (Mouse))
Sri International
Curated by ChEMBL
LigandPNGBDBM50008287(2-{4-[2-(2,4-Diamino-pyrido[2,3-d]pyrimidin-6-yl)-...)
Affinity DataKi:  0.00700nM. Assay description: Inhibition of the dihydrofolate reductase enzyme(DHFR) derived from L1210 murine leukemia cells.
In DepthDetails ArticlePubMed