BDBM50008400 2-[4-(2,6-Dioxo-1,3-dipropyl-2,3,6,7-tetrahydro-1H-purin-8-yl)-phenoxy]-N-{2-[3-(3-isothiocyanato-phenyl)-thioureido]-ethyl}-acetamide::CHEMBL268364
SMILES CCCn1c2nc([nH]c2c(=O)n(CCC)c1=O)-c1ccc(OCC(=O)NCCNC(=S)Nc2cccc(c2)N=C=S)cc1
InChI Key InChIKey=OKFOOQXOTKWKJI-UHFFFAOYSA-N
Data  3 KI
  Tab Delimited (TSV)   2D SDfile   Computed 3D by Vconf -m prep SDfile
Find this compound or compounds like it in BindingDB:
Activity Spreadsheet -- Enzyme Inhibition Constant Data from BindingDB
Found 3 hits for monomerid = 50008400
TargetAdenosine receptor A1(Rattus norvegicus (rat))
Niddk
Curated by ChEMBL
LigandPNGBDBM50008400(2-[4-(2,6-Dioxo-1,3-dipropyl-2,3,6,7-tetrahydro-1H...)
Affinity DataKi:  2.40nM. Assay description: Affinity for adenosine A1 receptor using [3H]N6-(phenylisopropyl)adenosine (R)-[3H]-PIA as a radioligand in rat brain.
In DepthDetails ArticlePubMed
TargetAdenosine receptor A1(Rattus norvegicus (rat))
Niddk
Curated by ChEMBL
LigandPNGBDBM50008400(2-[4-(2,6-Dioxo-1,3-dipropyl-2,3,6,7-tetrahydro-1H...)
Affinity DataKi:  2.40nM. Assay description: Binding affinity against adenosine A1 receptor using [3H]-CHA or [3H]PIA as radioligand
In DepthDetails ArticlePubMed
TargetAdenosine receptor A2a/A2b(Rattus norvegicus)
Niddk
Curated by ChEMBL
LigandPNGBDBM50008400(2-[4-(2,6-Dioxo-1,3-dipropyl-2,3,6,7-tetrahydro-1H...)
Affinity DataKi:  343nM. Assay description: Inhibition of [3H]N-ethyladenosine-5'-uronamide binding to Adenosine A2 receptor of rat striatal membrane
In DepthDetails ArticlePubMed