BDBM50008450 (3-Benzo[c]isothiazol-3-ylmethyl-4-oxo-3,4-dihydro-phthalazin-1-yl)-acetic acid::CHEMBL143569
SMILES OC(=O)Cc1nn(Cc2snc3ccccc23)c(=O)c2ccccc12
InChI Key InChIKey=KXJXYCGVDHCLRF-UHFFFAOYSA-N
Data  1 IC50
  Tab Delimited (TSV)   2D SDfile   Computed 3D by Vconf -m prep SDfile
Find this compound or compounds like it in BindingDB:
Activity Spreadsheet -- Enzyme Inhibition Constant Data from BindingDB
Found 1 hit for monomerid = 50008450
TargetAldo-keto reductase family 1 member B1(Homo sapiens (Human))
Pfizer
Curated by ChEMBL
LigandPNGBDBM50008450((3-Benzo[c]isothiazol-3-ylmethyl-4-oxo-3,4-dihydro...)
Affinity DataIC50:  720nM. Assay description: In vitro inhibitory activity against aldose reductase isolated from human placenta
In DepthDetails ArticlePubMed