BDBM50008559 4,5-Dimethoxy-2-methyl-indan-1-one::CHEMBL155371
SMILES COc1ccc2C(=O)C(C)Cc2c1OC
InChI Key InChIKey=RRGLXSHXUVBPPY-UHFFFAOYSA-N
Data  2 IC50
  Tab Delimited (TSV)   2D SDfile   Computed 3D by Vconf -m prep SDfile
Find this compound or compounds like it in BindingDB:
Activity Spreadsheet -- Enzyme Inhibition Constant Data from BindingDB
Found 2 hits for monomerid = 50008559
TargetAcetylcholinesterase(Homo sapiens (Human))
University Of Illinois
Curated by ChEMBL
LigandPNGBDBM50008559(4,5-Dimethoxy-2-methyl-indan-1-one | CHEMBL155371)
Affinity DataIC50:  380nM. Assay description: IC50 against acetylcholinesterase; value ranges from 1.3-380 nM.
In DepthDetails ArticlePubMed
TargetAcetylcholinesterase(Homo sapiens (Human))
University Of Illinois
Curated by ChEMBL
LigandPNGBDBM50008559(4,5-Dimethoxy-2-methyl-indan-1-one | CHEMBL155371)
Affinity DataIC50:  20nM. Assay description: Inhibition of acetylcholinesterase.
In DepthDetails ArticlePubMed