BDBM50008822 CHEMBL3236669
SMILES Oc1cc2oc3-c4oc5cc(O)c(O)cc5c4C(=O)C(=O)c3c2cc1O
InChI Key InChIKey=ZWDDWFGODIIHBZ-UHFFFAOYSA-N
Data  1 IC50
  Tab Delimited (TSV)   2D SDfile   Computed 3D by Vconf -m prep SDfile
Find this compound or compounds like it in BindingDB:
Activity Spreadsheet -- Enzyme Inhibition Constant Data from BindingDB
Found 1 hit for monomerid = 50008822
TargetVascular endothelial growth factor receptor 2(Homo sapiens (Human))
Meiji Pharmaceutical University
Curated by ChEMBL
LigandPNGBDBM50008822(CHEMBL3236669)
Affinity DataIC50:  3.20E+4nM. Assay description: Inhibition of recombinant human VEGFR2
In DepthDetails ArticlePubMed