BDBM50008873 CHEMBL3237025
SMILES CN(c1ccc(cc1)S(C)(=O)=O)S(=O)(=O)c1cccc(c1)C(=O)Nc1ccc(Cl)cc1
InChI Key InChIKey=QPHAGQITSGFARZ-UHFFFAOYSA-N
Data  1 IC50
  Tab Delimited (TSV)   2D SDfile   Computed 3D by Vconf -m prep SDfile
Find this compound or compounds like it in BindingDB:
Activity Spreadsheet -- Enzyme Inhibition Constant Data from BindingDB
Found 1 hit for monomerid = 50008873
TargetNAD-dependent protein deacetylase sirtuin-2(Homo sapiens (Human))
Northwestern University
Curated by ChEMBL
LigandPNGBDBM50008873(CHEMBL3237025)
Affinity DataIC50:  1.59E+4nM. Assay description: Inhibition of SIRT-2 (unknown origin) by fluorescence assay
In DepthDetails ArticlePubMed