BDBM50008963 2,6-Dichloro-4-[2-(3-methyl-isoxazol-5-yl)-vinyl]-phenol::CHEMBL148850
SMILES Cc1cc(\C=C\c2cc(Cl)c(O)c(Cl)c2)on1
InChI Key InChIKey=KNMVBMAVTYGHKU-NSCUHMNNSA-N
Data  2 IC50
  Tab Delimited (TSV)   2D SDfile   Computed 3D by Vconf -m prep SDfile
Find this compound or compounds like it in BindingDB:
Activity Spreadsheet -- Enzyme Inhibition Constant Data from BindingDB
Found 2 hits for monomerid = 50008963
TargetProstaglandin G/H synthase 1/2(RAT)
Warner-Lambert
Curated by ChEMBL
LigandPNGBDBM50008963(2,6-Dichloro-4-[2-(3-methyl-isoxazol-5-yl)-vinyl]-...)
Affinity DataIC50:  1.38E+4nM. Assay description: Inhibitory activity against cyclooxygenase in rat basophilic leukemia cells using prostaglandin G/H synthase assay
In DepthDetails ArticlePubMed
TargetPolyunsaturated fatty acid 5-lipoxygenase(Rattus norvegicus)
Warner-Lambert
Curated by ChEMBL
LigandPNGBDBM50008963(2,6-Dichloro-4-[2-(3-methyl-isoxazol-5-yl)-vinyl]-...)
Affinity DataIC50:  2.10E+4nM. Assay description: Inhibitory activity against 5-lipoxygenase in rat basophilic leukemia cells
In DepthDetails ArticlePubMed