BDBM50009037 1-(1-Ethoxy-ethyl)-2-(4-ethylsulfanyl-3-methyl-pyridin-2-ylmethanesulfinyl)-1H-benzoimidazole::CHEMBL268465
SMILES CCOC(C)n1c(nc2ccccc12)S(=O)Cc1nccc(SCC)c1C
InChI Key InChIKey=VYXDDSWGPLBVOZ-UHFFFAOYSA-N
Data  1 IC50
  Tab Delimited (TSV)   2D SDfile   Computed 3D by Vconf -m prep SDfile
Find this compound or compounds like it in BindingDB:
Activity Spreadsheet -- Enzyme Inhibition Constant Data from BindingDB
Found 1 hit for monomerid = 50009037
LigandPNGBDBM50009037(1-(1-Ethoxy-ethyl)-2-(4-ethylsulfanyl-3-methyl-pyr...)
Affinity DataIC50:  2.00E+5nM. Assay description: Activity was evaluated by measuring the inhibition of isolated hog H+/K+ ATPase
In DepthDetails ArticlePubMed