BDBM50009163 CHEMBL3238334
SMILES COc1cccc(c1)C(=O)\C=C\c1ccc(\C=C\C(=O)c2cccc(OC)c2)cc1
InChI Key InChIKey=CBSARZPLOQEWTN-WXUKJITCSA-N
Data  1 EC50
  Tab Delimited (TSV)   2D SDfile   Computed 3D by Vconf -m prep SDfile
Find this compound or compounds like it in BindingDB:
Activity Spreadsheet -- Enzyme Inhibition Constant Data from BindingDB
Found 1 hit for monomerid = 50009163
TargetBroad substrate specificity ATP-binding cassette transporter ABCG2(Homo sapiens (Human))
Bmssi Umr 5086 Cnrs/Universit£
Curated by ChEMBL
LigandPNGBDBM50009163(CHEMBL3238334)
Affinity DataEC50:  2.30E+3nM. Assay description: Inhibition of ABCG2 (unknown origin) transfected in HEK293 cells assessed as inhibition of mitoxantrone efflux after 30 mins by flow cytometry relati...
In DepthDetails ArticlePubMed