BDBM50009164 CHEMBL3238335
SMILES COc1ccc(cc1OC)C(=O)\C=C\c1ccc(\C=C\C(=O)c2ccc(OC)c(OC)c2)cc1
InChI Key InChIKey=HJKGROWCHWZNNX-UTLPMFLDSA-N
Data  1 EC50
  Tab Delimited (TSV)   2D SDfile   Computed 3D by Vconf -m prep SDfile
Find this compound or compounds like it in BindingDB:
Activity Spreadsheet -- Enzyme Inhibition Constant Data from BindingDB
Found 1 hit for monomerid = 50009164
TargetBroad substrate specificity ATP-binding cassette transporter ABCG2(Homo sapiens (Human))
Bmssi Umr 5086 Cnrs/Universit£
Curated by ChEMBL
LigandPNGBDBM50009164(CHEMBL3238335)
Affinity DataEC50:  800nM. Assay description: Inhibition of ABCG2 (unknown origin) transfected in HEK293 cells assessed as inhibition of mitoxantrone efflux after 30 mins by flow cytometry relati...
In DepthDetails ArticlePubMed