BDBM50009213 CHEMBL3233180
SMILES CC(C)N(C)[C@@H]1CC[C@@H]([C@H](CS(C)(=O)=O)C1)N1CC[C@H](NC(=O)c2cccc(c2)C(C)(C)C)C1=O
InChI Key InChIKey=HLRAWMGOLABNON-IGABQKFOSA-N
Data  2 IC50
  Tab Delimited (TSV)   2D SDfile   Computed 3D by Vconf -m prep SDfile
Find this compound or compounds like it in BindingDB:
Activity Spreadsheet -- Enzyme Inhibition Constant Data from BindingDB
Found 2 hits for monomerid = 50009213
TargetPotassium voltage-gated channel subfamily H member 2(Homo sapiens (Human))
Bristol-Myers Squibb
Curated by ChEMBL
LigandPNGBDBM50009213(CHEMBL3233180)
Affinity DataIC50: >8.00E+4nM. Assay description: Inhibition of human ERG by FLIPR assay
In DepthDetails ArticlePubMed
TargetC-C chemokine receptor type 2(Homo sapiens (Human))
Bristol-Myers Squibb
Curated by ChEMBL
LigandPNGBDBM50009213(CHEMBL3233180)
Affinity DataIC50:  1.20nM. Assay description: Displacement of [125I]-labeled human MCP1 from CCR2 in human PBMC
In DepthDetails ArticlePubMed