BDBM50009225 3-Ethyl-1-(3-hydroxy-propyl)-2-[3-(1,3,3-trimethyl-1,3-dihydro-indol-2-ylidene)-propenyl]-3H-imidazo[4,5-b]quinoxalin-1-ium; chloride::CHEMBL300854
SMILES CCn1c(\C=C\C=C2\N(C)c3ccccc3C2(C)C)[n+](CCCO)c2nc3ccccc3nc12
InChI Key InChIKey=SIKNXZKOTNWDHU-UHFFFAOYSA-N
Data  1 IC50
  Tab Delimited (TSV)   2D SDfile   Computed 3D by Vconf -m prep SDfile
Find this compound or compounds like it in BindingDB:
Activity Spreadsheet -- Enzyme Inhibition Constant Data from BindingDB
Found 1 hit for monomerid = 50009225
TargetSubstance-P receptor(Rattus norvegicus (rat))
Rochester
Curated by ChEMBL
LigandPNGBDBM50009225(3-Ethyl-1-(3-hydroxy-propyl)-2-[3-(1,3,3-trimethyl...)
Affinity DataIC50:  350nM. Assay description: Binding affinity for tachykinin receptor 1 from rat forebrain tissue, [125I]-BH-SP as radioligand
In DepthDetails ArticlePubMed