BDBM50009304 CHEMBL3233531
SMILES OCC[C@@H]1CN(CC2CCCCC2)CCN1Cc1cccc2ccccc12
InChI Key InChIKey=TZAWKCIVGVDWDQ-HSZRJFAPSA-N
Data  2 KI
  Tab Delimited (TSV)   2D SDfile   Computed 3D by Vconf -m prep SDfile
Find this compound or compounds like it in BindingDB:
Activity Spreadsheet -- Enzyme Inhibition Constant Data from BindingDB
Found 2 hits for monomerid = 50009304
TargetSigma non-opioid intracellular receptor 1(Cavia porcellus (Guinea pig))
University Of M£Nster
Curated by ChEMBL
LigandPNGBDBM50009304(CHEMBL3233531)
Affinity DataKi:  0.900nM. Assay description: Displacement of [3H]-(+)-pentazocine from sigma-1 receptor in guinea pig brain cortex membranes after 120 mins by scintillation counting analysis
In DepthDetails ArticlePubMed
TargetSigma non-opioid intracellular receptor 1(Homo sapiens (Human))
University Of M£Nster
Curated by ChEMBL
LigandPNGBDBM50009304(CHEMBL3233531)
Affinity DataKi:  7.5nM. Assay description: Displacement of [3H]-(+)-pentazocine from sigma-1 receptor in human RPMI8226 cell membranes after 120 mins by scintillation counting analysis
In DepthDetails ArticlePubMed