BDBM50009551 2-[6-Amino-2-(3-ethyl-pentylamino)-purin-9-yl]-5-hydroxymethyl-tetrahydro-furan-3,4-diol::CHEMBL2374405
SMILES CCC(CC)CCNc1nc(N)c2ncn([C@@H]3O[C@H](CO)[C@@H](O)[C@H]3O)c2n1
InChI Key InChIKey=IHEQKVKBDRHZFL-XNIJJKJLSA-N
Data  2 IC50
  Tab Delimited (TSV)   2D SDfile   Computed 3D by Vconf -m prep SDfile
Find this compound or compounds like it in BindingDB:
Activity Spreadsheet -- Enzyme Inhibition Constant Data from BindingDB
Found 2 hits for monomerid = 50009551
TargetAdenosine receptor A2a/A2b(Rattus norvegicus)
Ciba-Geigy
Curated by ChEMBL
LigandPNGBDBM50009551(2-[6-Amino-2-(3-ethyl-pentylamino)-purin-9-yl]-5-h...)
Affinity DataIC50:  603nM. Assay description: Concentration required for 50% inhibition of [3H]NECA binding on rat brain adenosine A2 receptor
In DepthDetails ArticlePubMed
TargetAdenosine receptor A1(Rattus norvegicus (rat))
Ciba-Geigy
Curated by ChEMBL
LigandPNGBDBM50009551(2-[6-Amino-2-(3-ethyl-pentylamino)-purin-9-yl]-5-h...)
Affinity DataIC50:  5.89E+3nM. Assay description: Concentration required for 50% inhibition of [3H]-CHA binding on rat brain adenosine A1 receptor
In DepthDetails ArticlePubMed