BDBM50009594 1-(4-Bromo-phenyl)-3-(4-phenyl-piperazin-1-yl)-propan-2-ol::CHEMBL87177
SMILES OC(CN1CCN(CC1)c1ccccc1)Cc1ccc(Br)cc1
InChI Key InChIKey=LLFKSJJIEKGMLU-UHFFFAOYSA-N
Data  1 IC50
  Tab Delimited (TSV)   2D SDfile   Computed 3D by Vconf -m prep SDfile
Find this compound or compounds like it in BindingDB:
Activity Spreadsheet -- Enzyme Inhibition Constant Data from BindingDB
Found 1 hit for monomerid = 50009594
TargetVesicular acetylcholine transporter(Torpedo californica)
University Of Minnesota
Curated by ChEMBL
LigandPNGBDBM50009594(1-(4-Bromo-phenyl)-3-(4-phenyl-piperazin-1-yl)-pro...)
Affinity DataIC50:  1.54E+3nM. Assay description: Displacement of [3H]-Vesamicol from Vesamicol receptor of Torpedo californica
In DepthDetails ArticlePubMed