BDBM50009610 6-Methoxy-2-pyridin-4-ylmethylene-3,4-dihydro-2H-naphthalen-1-one::6-methoxy-2-(pyridin-4-ylmethylene)-3,4-dihydronaphthalen-1(2H)-one::CHEMBL328217
SMILES COc1ccc2C(=O)\C(CCc2c1)=C\c1ccncc1
InChI Key InChIKey=OMJQCRYAFOMMKI-GXDHUFHOSA-N
Data  1 IC50
  Tab Delimited (TSV)   2D SDfile   Computed 3D by Vconf -m prep SDfile
Find this compound or compounds like it in BindingDB:
Activity Spreadsheet -- Enzyme Inhibition Constant Data from BindingDB
Found 1 hit for monomerid = 50009610
TargetAromatase(Homo sapiens (Human))
UniversitäT Des Saarlandes
Curated by ChEMBL
LigandPNGBDBM50009610(6-Methoxy-2-pyridin-4-ylmethylene-3,4-dihydro-2H-n...)
Affinity DataIC50:  8.90E+3nM. Assay description: In vitro inhibitory concentration against human placental Cytochrome P450 19A was determined using [1beta,2beta-3H]testosterone as radioligand
In DepthDetails ArticlePubMed