BDBM50009633 CHEMBL3234859
SMILES C[C@@H](N1C(=O)O[C@@](Cc2ccccc2)(C1=O)c1nnc(o1)-c1cc(F)cc(F)c1)c1ccccc1
InChI Key InChIKey=ROSQRLJLRJDAJI-AKJBCIBTSA-N
Data  1 IC50
  Tab Delimited (TSV)   2D SDfile   Computed 3D by Vconf -m prep SDfile
Find this compound or compounds like it in BindingDB:
Activity Spreadsheet -- Enzyme Inhibition Constant Data from BindingDB
Found 1 hit for monomerid = 50009633
TargetMineralocorticoid receptor(Homo sapiens (Human))
Merck Research Laboratories
Curated by ChEMBL
LigandPNGBDBM50009633(CHEMBL3234859)
Affinity DataIC50:  270nM. Assay description: Antagonist activity at mineralocorticoid receptor (unknown origin) by PathHunter assay
In DepthDetails ArticlePubMed