BDBM50009701 (1-Phenyl-propyl)-(9-phenyl-9H-purin-6-yl)-amine::CHEMBL96014
SMILES CC[C@H](Nc1ncnc2n(cnc12)-c1ccccc1)c1ccccc1
InChI Key InChIKey=KOEVJHYBDHDPOK-KRWDZBQOSA-N
Data  3 KI
  Tab Delimited (TSV)   2D SDfile   Computed 3D by Vconf -m prep SDfile
Find this compound or compounds like it in BindingDB:
Activity Spreadsheet -- Enzyme Inhibition Constant Data from BindingDB
Found 3 hits for monomerid = 50009701
TargetAdenosine receptor A1(Rattus norvegicus (rat))
University Of South Florida
Curated by ChEMBL
LigandPNGBDBM50009701((1-Phenyl-propyl)-(9-phenyl-9H-purin-6-yl)-amine |...)
Affinity DataKi:  7.20E+3nM. Assay description: Binding affinity against adenosine A1 receptor in rat cortex by using [3H]- PIA as a radioligand
In DepthDetails ArticlePubMed
TargetAdenosine receptor A2a/A2b(Rattus norvegicus)
University Of South Florida
Curated by ChEMBL
LigandPNGBDBM50009701((1-Phenyl-propyl)-(9-phenyl-9H-purin-6-yl)-amine |...)
Affinity DataKi:  9.90E+3nM. Assay description: Tested for inhibition of rat PC12 adenylate cyclase stimulation by using NECA as a radioligand
In DepthDetails ArticlePubMed
TargetAdenosine receptor A2a/A2b(Rattus norvegicus)
University Of South Florida
Curated by ChEMBL
LigandPNGBDBM50009701((1-Phenyl-propyl)-(9-phenyl-9H-purin-6-yl)-amine |...)
Affinity DataKi:  1.80E+4nM. Assay description: Binding affinity against adenosine A2 receptor in rat striatum by using [3H]NECA as a radioligand
In DepthDetails ArticlePubMed