BDBM50009710 4-Amino-1-phenyl-5-propyl-1,5-dihydro-pyrazolo[3,4-d]pyrimidin-6-one::CHEMBL95589
SMILES CCCn1c(N)c2cnn(-c3ccccc3)c2nc1=O
InChI Key InChIKey=PIEYJPNIGGGQDY-UHFFFAOYSA-N
Data  2 IC50
  Tab Delimited (TSV)   2D SDfile   Computed 3D by Vconf -m prep SDfile
Find this compound or compounds like it in BindingDB:
Activity Spreadsheet -- Enzyme Inhibition Constant Data from BindingDB
Found 2 hits for monomerid = 50009710
TargetAdenosine receptor A2a/A2b(Rattus norvegicus)
Griffith University
Curated by ChEMBL
LigandPNGBDBM50009710(4-Amino-1-phenyl-5-propyl-1,5-dihydro-pyrazolo[3,4...)
Affinity DataIC50:  5.02E+4nM. Assay description: Inhibitory concentration against R[3H]-N6-PIA binding to adenosine A2 receptors in rat striatal membrane
In DepthDetails ArticlePubMed
TargetAdenosine receptor A1(Rattus norvegicus (rat))
Griffith University
Curated by ChEMBL
LigandPNGBDBM50009710(4-Amino-1-phenyl-5-propyl-1,5-dihydro-pyrazolo[3,4...)
Affinity DataIC50:  5.07E+4nM. Assay description: Inhibitory concentration against R[3H]-N6-PIA binding to adenosine A1 receptor in rat whole brain membrane
In DepthDetails ArticlePubMed