BDBM50009875 3-Hydroxy-6-methyl-4-[6-(3-methyl-thioureido)-2-(3-naphthalen-1-yl-2-naphthalen-1-ylmethyl-propionylamino)-hexanoylamino]-heptanoic acid (1-benzylcarbamoyl-3-methyl-butyl)-amide::CHEMBL22419
SMILES CNC(=S)NCCCCC(NC(=O)C(Cc1cccc2ccccc12)Cc1cccc2ccccc12)C(=O)NC(CC(C)C)[C@@H](O)CC(=O)NC(CC(C)C)C(=O)NCc1ccccc1
InChI Key InChIKey=OJALSVLVAASDKI-HJDAKRCQSA-N
Data  2 IC50
  Tab Delimited (TSV)   2D SDfile   Computed 3D by Vconf -m prep SDfile
Find this compound or compounds like it in BindingDB:
Activity Spreadsheet -- Enzyme Inhibition Constant Data from BindingDB
Found 2 hits for monomerid = 50009875
TargetRenin(Homo sapiens (Human))
Warner-Lambert
Curated by ChEMBL
LigandPNGBDBM50009875(3-Hydroxy-6-methyl-4-[6-(3-methyl-thioureido)-2-(3...)
Affinity DataIC50:  60nM. Assay description: Inhibitory activity against human plasma renin; G means not measured
In DepthDetails ArticlePubMed
TargetRenin(Homo sapiens (Human))
Warner-Lambert
Curated by ChEMBL
LigandPNGBDBM50009875(3-Hydroxy-6-methyl-4-[6-(3-methyl-thioureido)-2-(3...)
Affinity DataIC50:  60nM. Assay description: Inhibitory activity against human plasma renin
In DepthDetails ArticlePubMed