BDBM50009881 3-Hydroxy-6-methyl-4-[7-(3-methyl-thioureido)-2-(3-naphthalen-1-yl-2-naphthalen-1-ylmethyl-propionylamino)-heptanoylamino]-heptanoic acid (2-methyl-butyl)-amide::CHEMBL23160
SMILES CCC(C)CNC(=O)C[C@H](O)C(CC(C)C)NC(=O)C(CCCCCNC(=S)NC)NC(=O)C(Cc1cccc2ccccc12)Cc1cccc2ccccc12
InChI Key InChIKey=XMPIKRAPEVQBFH-SAKJEASGSA-N
Data  2 IC50
  Tab Delimited (TSV)   2D SDfile   Computed 3D by Vconf -m prep SDfile
Find this compound or compounds like it in BindingDB:
Activity Spreadsheet -- Enzyme Inhibition Constant Data from BindingDB
Found 2 hits for monomerid = 50009881
TargetRenin(Homo sapiens (Human))
Warner-Lambert
Curated by ChEMBL
LigandPNGBDBM50009881(3-Hydroxy-6-methyl-4-[7-(3-methyl-thioureido)-2-(3...)
Affinity DataIC50:  40nM. Assay description: Inhibitory activity against human plasma renin
In DepthDetails ArticlePubMed
TargetRenin(Homo sapiens (Human))
Warner-Lambert
Curated by ChEMBL
LigandPNGBDBM50009881(3-Hydroxy-6-methyl-4-[7-(3-methyl-thioureido)-2-(3...)
Affinity DataIC50:  39nM. Assay description: Inhibitory activity against monkey plasma renin.
In DepthDetails ArticlePubMed