BDBM50009887 1N-(2-methylbutyl)-4-{6-amino(nitro)(imino)methylamino-1-[2-(1-naphthyl)-1-(1-naphthylmethyl)ethylcarboxamido]hexylcarboxamido}-3-hydroxy-6-methyl-(3S,4R)-heptanamide::CHEMBL23792
SMILES CCC(C)CNC(=O)C[C@H](O)C(CC(C)C)NC(=O)C(CCCCCNC(=N)N[N+]([O-])=O)NC(=O)C(Cc1cccc2ccccc12)Cc1cccc2ccccc12
InChI Key InChIKey=KOYYNTVXZJGAPD-PASJKQFYSA-N
Data  3 IC50
  Tab Delimited (TSV)   2D SDfile   Computed 3D by Vconf -m prep SDfile
Find this compound or compounds like it in BindingDB:
Activity Spreadsheet -- Enzyme Inhibition Constant Data from BindingDB
Found 3 hits for monomerid = 50009887
TargetRenin(Homo sapiens (Human))
Warner-Lambert
Curated by ChEMBL
LigandPNGBDBM50009887(1N-(2-methylbutyl)-4-{6-amino(nitro)(imino)methyla...)
Affinity DataIC50:  20nM. Assay description: Inhibitory activity against monkey plasma renin.
In DepthDetails ArticlePubMed
TargetCathepsin D(Bos taurus)
Warner-Lambert
Curated by ChEMBL
LigandPNGBDBM50009887(1N-(2-methylbutyl)-4-{6-amino(nitro)(imino)methyla...)
Affinity DataIC50:  1.47E+3nM. Assay description: Inhibitory activity against bovine cathepsin D was determined
In DepthDetails ArticlePubMed
TargetRenin(Homo sapiens (Human))
Warner-Lambert
Curated by ChEMBL
LigandPNGBDBM50009887(1N-(2-methylbutyl)-4-{6-amino(nitro)(imino)methyla...)
Affinity DataIC50:  26nM. Assay description: Inhibitory activity against monkey plasma renin.
In DepthDetails ArticlePubMed