BDBM50009907 6-(3-Methyl-thioureido)-2-(4-morpholin-4-yl-2-naphthalen-1-ylmethyl-4-oxo-butyrylamino)-hexanoic acid {4-[2-(2-amino-ethyl)-morpholin-4-yl]-2-hydroxy-1-isobutyl-4-oxo-butyl}-amide::CHEMBL22311
SMILES CNC(=S)NCCCCC(NC(=O)C(CC(=O)N1CCOCC1)Cc1cccc2ccccc12)C(=O)NC(CC(C)C)[C@@H](O)CC(=O)N1CCOC(CCN)C1
InChI Key InChIKey=OVKAUXLVRGDPOY-RCIWBYGCSA-N
Data  2 IC50
  Tab Delimited (TSV)   2D SDfile   Computed 3D by Vconf -m prep SDfile
Find this compound or compounds like it in BindingDB:
Activity Spreadsheet -- Enzyme Inhibition Constant Data from BindingDB
Found 2 hits for monomerid = 50009907
TargetRenin(Homo sapiens (Human))
Warner-Lambert
Curated by ChEMBL
LigandPNGBDBM50009907(6-(3-Methyl-thioureido)-2-(4-morpholin-4-yl-2-naph...)
Affinity DataIC50:  108nM. Assay description: Inhibitory activity against human plasma renin
In DepthDetails ArticlePubMed
TargetRenin(Homo sapiens (Human))
Warner-Lambert
Curated by ChEMBL
LigandPNGBDBM50009907(6-(3-Methyl-thioureido)-2-(4-morpholin-4-yl-2-naph...)
Affinity DataIC50:  693nM. Assay description: Inhibitory activity against monkey plasma renin.
In DepthDetails ArticlePubMed