BDBM50009915 6-Formylamino-2-(3-naphthalen-1-yl-2-naphthalen-1-ylmethyl-propionylamino)-hex-4-ynoic acid {4-[2-(2-amino-ethyl)-morpholin-4-yl]-1-cyclohexylmethyl-2-hydroxy-4-oxo-butyl}-amide::CHEMBL22858
SMILES NCCC1CN(CCO1)C(=O)C[C@H](O)C(CC1CCCCC1)NC(=O)C(CC#CCNC=O)NC(=O)C(Cc1cccc2ccccc12)Cc1cccc2ccccc12
InChI Key InChIKey=YHWBUOKQPGXDCB-BNRLSTEOSA-N
Data  1 IC50
  Tab Delimited (TSV)   2D SDfile   Computed 3D by Vconf -m prep SDfile
Find this compound or compounds like it in BindingDB:
Activity Spreadsheet -- Enzyme Inhibition Constant Data from BindingDB
Found 1 hit for monomerid = 50009915
TargetRenin(Homo sapiens (Human))
Warner-Lambert
Curated by ChEMBL
LigandPNGBDBM50009915(6-Formylamino-2-(3-naphthalen-1-yl-2-naphthalen-1-...)
Affinity DataIC50:  8.70nM. Assay description: Inhibitory activity against monkey plasma renin.
In DepthDetails ArticlePubMed