BDBM50009933 4-(2-Methoxy-ethyl)-1-(4-methoxy-phenyl)-pyrazolidin-3-one::CHEMBL39273
SMILES COCCC1CN(NC1=O)c1ccc(OC)cc1
InChI Key InChIKey=RBSCJQFNIFTNEE-UHFFFAOYSA-N
Data  1 IC50
  Tab Delimited (TSV)   2D SDfile   Computed 3D by Vconf -m prep SDfile
Find this compound or compounds like it in BindingDB:
Activity Spreadsheet -- Enzyme Inhibition Constant Data from BindingDB
Found 1 hit for monomerid = 50009933
TargetPolyunsaturated fatty acid 5-lipoxygenase(Rattus norvegicus)
Sterling Research Group
Curated by ChEMBL
LigandPNGBDBM50009933(4-(2-Methoxy-ethyl)-1-(4-methoxy-phenyl)-pyrazolid...)
Affinity DataIC50:  1.46E+3nM. Assay description: In vitro inhibition of rat 5-Lipoxygenase
In DepthDetails ArticlePubMed