BDBM50009935 4-(2-Methoxy-ethyl)-5,5-dimethyl-1-phenyl-pyrazolidin-3-one::CHEMBL41573
SMILES COCCC1C(=O)NN(c2ccccc2)C1(C)C
InChI Key InChIKey=YIJHPDAARSRNLX-UHFFFAOYSA-N
Data  1 IC50
  Tab Delimited (TSV)   2D SDfile   Computed 3D by Vconf -m prep SDfile
Find this compound or compounds like it in BindingDB:
Activity Spreadsheet -- Enzyme Inhibition Constant Data from BindingDB
Found 1 hit for monomerid = 50009935
TargetPolyunsaturated fatty acid 5-lipoxygenase(Rattus norvegicus)
Sterling Research Group
Curated by ChEMBL
LigandPNGBDBM50009935(4-(2-Methoxy-ethyl)-5,5-dimethyl-1-phenyl-pyrazoli...)
Affinity DataIC50: >1.00E+3nM. Assay description: In vitro inhibition of rat 5-Lipoxygenase
In DepthDetails ArticlePubMed