BDBM50009950 4-(2-Ethoxy-ethyl)-1-phenyl-pyrazolidin-3-one::CHEMBL289710
SMILES CCOCCC1CN(NC1=O)c1ccccc1
InChI Key InChIKey=QWUIZGUWAIHJHS-UHFFFAOYSA-N
Data  1 IC50
  Tab Delimited (TSV)   2D SDfile   Computed 3D by Vconf -m prep SDfile
Find this compound or compounds like it in BindingDB:
Activity Spreadsheet -- Enzyme Inhibition Constant Data from BindingDB
Found 1 hit for monomerid = 50009950
TargetPolyunsaturated fatty acid 5-lipoxygenase(Rattus norvegicus)
Sterling Research Group
Curated by ChEMBL
LigandPNGBDBM50009950(4-(2-Ethoxy-ethyl)-1-phenyl-pyrazolidin-3-one | CH...)
Affinity DataIC50:  150nM. Assay description: In vitro inhibition of rat 5-Lipoxygenase
In DepthDetails ArticlePubMed