BDBM50009953 1-(3,4-Dichloro-phenyl)-4-(2-methoxy-ethyl)-pyrazolidin-3-one::CHEMBL417166
SMILES COCCC1CN(NC1=O)c1ccc(Cl)c(Cl)c1
InChI Key InChIKey=GJZIWUYKZDKLRF-UHFFFAOYSA-N
Data  1 IC50
  Tab Delimited (TSV)   2D SDfile   Computed 3D by Vconf -m prep SDfile
Find this compound or compounds like it in BindingDB:
Activity Spreadsheet -- Enzyme Inhibition Constant Data from BindingDB
Found 1 hit for monomerid = 50009953
TargetPolyunsaturated fatty acid 5-lipoxygenase(Rattus norvegicus)
Sterling Research Group
Curated by ChEMBL
LigandPNGBDBM50009953(1-(3,4-Dichloro-phenyl)-4-(2-methoxy-ethyl)-pyrazo...)
Affinity DataIC50:  190nM. Assay description: In vitro inhibition of rat 5-Lipoxygenase
In DepthDetails ArticlePubMed