BDBM50010127 CHEMBL3245415
SMILES NC(=N)c1ccc(OCCCCCCCCCCCCOc2ccc(cc2)C(N)=N)cc1
InChI Key InChIKey=DTOASLVGGYJNHB-UHFFFAOYSA-N
Data  1 KI
  Tab Delimited (TSV)   2D SDfile   Computed 3D by Vconf -m prep SDfile
Find this compound or compounds like it in BindingDB:
Activity Spreadsheet -- Enzyme Inhibition Constant Data from BindingDB
Found 1 hit for monomerid = 50010127
TargetAcrosin(Sus scrofa)
TBA
Curated by ChEMBL
LigandPNGBDBM50010127(CHEMBL3245415)
Affinity DataKi:  440nM. Assay description: Reversible competitive inhibition of boar spermatozoa acrosin using BzArgOEt as substrate by Dixon plot analysis
In DepthDetails ArticlePubMed