BDBM50010142 CHEBI:3070::CHEMBL476869
SMILES CC(C)C[C@@H](NC(=O)[C@@H](O)[C@H](N)Cc1ccccc1)C(O)=O
InChI Key InChIKey=VGGGPCQERPFHOB-MCIONIFRSA-N
Data  1 IC50
  Tab Delimited (TSV)   2D SDfile   Computed 3D by Vconf -m prep SDfile
Find this compound or compounds like it in BindingDB:
Activity Spreadsheet -- Enzyme Inhibition Constant Data from BindingDB
Found 1 hit for monomerid = 50010142
TargetAminopeptidase B(Rattus norvegicus)
TBA
Curated by ChEMBL
LigandPNGBDBM50010142(CHEBI:3070 | CHEMBL476869)
Affinity DataIC50:  1.80E+3nM. Assay description: Inhibition of rat liver aminopeptidase B using 0.2 mM L-leucine-beta-naphthylamide by colorimetry
In DepthDetails ArticlePubMed